Christian dot schaffer at muenchen dot de
Jul 15, 2010 at 9:01 am
From:
Operating system: Solaris 10 x86
PHP version: 5.3.2
Package: Compile Failure
Bug Type: Bug
Bug description:make fails: glob_wrapper.c:40

Description:
------------
On Solaris 10 (11/09) x86, opensource packages from www.sunfreeware.com
Desired PHP-Version 5.3.2

Make fails with following error:
/bin/sh /data/build/php/532/php-5.3.2/libtool --silent --preserve-dup-deps
--mode=compile gcc -Imain/streams/
-I/data/build/php/532/php-5.3.2/main/streams/ -DPHP_ATOM_INC
-I/data/build/php/532/php-5.3.2/include
-I/data/build/php/532/php-5.3.2/main -I/data/build/php/532/php-5.3.2
-I/data/build/php/532/php-5.3.2/ext/date/lib
-I/data/build/php/532/php-5.3.2/ext/ereg/regex -I/usr/local/include/libxml2
-I/usr/local/ssl/include -I/usr/local/include
-I/usr/local/include/freetype2 -I/usr/local/imap-2007e/include
-I/data/build/php/532/php-5.3.2/ext/mbstring/oniguruma
-I/data/build/php/532/php-5.3.2/ext/mbstring/libmbfl
-I/data/build/php/532/php-5.3.2/ext/mbstring/libmbfl/mbfl
-I/usr/include/mysql -I/opt/oracle/client/rdbms/public
-I/data/build/php/532/php-5.3.2/ext/sqlite3/libsqlite
-I/usr/local/pgsql/include -I/data/build/php/532/php-5.3.2/TSRM
-I/data/build/php/532/php-5.3.2/Zend -D_POSIX_PTHREAD_SEMANTICS
-I/usr/local/include -g -O2 -c
/data/build/php/532/php-5.3.2/main/streams/glob_wrapper.c -o
main/streams/glob_wrapper.lo
/data/build/php/532/php-5.3.2/main/streams/glob_wrapper.c:40: Fehler:
Syntaxfehler vor "glob_t"
/data/build/php/532/php-5.3.2/main/streams/glob_wrapper.c:40: Warnung: kein
Semikolon am Ende von »struct« oder »union«
/data/build/php/532/php-5.3.2/main/streams/glob_wrapper.c:47: Fehler:
Syntaxfehler vor »}«-Zeichen
/data/build/php/532/php-5.3.2/main/streams/glob_wrapper.c:47: Warnung:
Datendefinition hat keinen Typ oder Speicherklasse
/data/build/php/532/php-5.3.2/main/streams/glob_wrapper.c: In function
`_php_glob_stream_get_path':
/data/build/php/532/php-5.3.2/main/streams/glob_wrapper.c:51: Fehler:
»pglob« nicht deklariert (erste Benutzung in dieser Funktion)
/data/build/php/532/php-5.3.2/main/streams/glob_wrapper.c:51: Fehler:
(Jeder nicht deklarierte Bezeichner wird nur einmal aufgeführt
/data/build/php/532/php-5.3.2/main/streams/glob_wrapper.c:51: Fehler: für
jede Funktion in der er auftritt.)
/data/build/php/532/php-5.3.2/main/streams/glob_wrapper.c:51: Fehler:
Syntaxfehler vor »)«-Zeichen
/data/build/php/532/php-5.3.2/main/streams/glob_wrapper.c: In function
`_php_glob_stream_get_pattern':
/data/build/php/532/php-5.3.2/main/streams/glob_wrapper.c:73: Fehler:
»pglob« nicht deklariert (erste Benutzung in dieser Funktion)
/data/build/php/532/php-5.3.2/main/streams/glob_wrapper.c:73: Fehler:
Syntaxfehler vor »)«-Zeichen
/data/build/php/532/php-5.3.2/main/streams/glob_wrapper.c: In function
`_php_glob_stream_get_count':
/data/build/php/532/php-5.3.2/main/streams/glob_wrapper.c:95: Fehler:
»pglob« nicht deklariert (erste Benutzung in dieser Funktion)
/data/build/php/532/php-5.3.2/main/streams/glob_wrapper.c:95: Fehler:
Syntaxfehler vor »)«-Zeichen
/data/build/php/532/php-5.3.2/main/streams/glob_wrapper.c: At top level:
/data/build/php/532/php-5.3.2/main/streams/glob_wrapper.c:111: Fehler:
Syntaxfehler vor »*«-Zeichen
/data/build/php/532/php-5.3.2/main/streams/glob_wrapper.c: In function
`php_glob_stream_path_split':
/data/build/php/532/php-5.3.2/main/streams/glob_wrapper.c:124: Fehler:
»p_file« nicht deklariert (erste Benutzung in dieser Funktion)
/data/build/php/532/php-5.3.2/main/streams/glob_wrapper.c:126: Fehler:
»get_path« nicht deklariert (erste Benutzung in dieser Funktion)
/data/build/php/532/php-5.3.2/main/streams/glob_wrapper.c:127: Fehler:
»pglob« nicht deklariert (erste Benutzung in dieser Funktion)
/data/build/php/532/php-5.3.2/main/streams/glob_wrapper.c: In function
`php_glob_stream_read':
/data/build/php/532/php-5.3.2/main/streams/glob_wrapper.c:141: Fehler:
»pglob« nicht deklariert (erste Benutzung in dieser Funktion)
/data/build/php/532/php-5.3.2/main/streams/glob_wrapper.c:141: Fehler:
Syntaxfehler vor »)«-Zeichen
/data/build/php/532/php-5.3.2/main/streams/glob_wrapper.c:148: Fehler:
»GLOB_APPEND« nicht deklariert (erste Benutzung in dieser Funktion)
/data/build/php/532/php-5.3.2/main/streams/glob_wrapper.c: In function
`php_glob_stream_close':
/data/build/php/532/php-5.3.2/main/streams/glob_wrapper.c:165: Fehler:
»pglob« nicht deklariert (erste Benutzung in dieser Funktion)
/data/build/php/532/php-5.3.2/main/streams/glob_wrapper.c:165: Fehler:
Syntaxfehler vor »)«-Zeichen
/data/build/php/532/php-5.3.2/main/streams/glob_wrapper.c: In function
`php_glob_stream_rewind':
/data/build/php/532/php-5.3.2/main/streams/glob_wrapper.c:184: Fehler:
»pglob« nicht deklariert (erste Benutzung in dieser Funktion)
/data/build/php/532/php-5.3.2/main/streams/glob_wrapper.c:184: Fehler:
Syntaxfehler vor »)«-Zeichen
/data/build/php/532/php-5.3.2/main/streams/glob_wrapper.c: In function
`php_glob_stream_opener':
/data/build/php/532/php-5.3.2/main/streams/glob_wrapper.c:211: Fehler:
»pglob« nicht deklariert (erste Benutzung in dieser Funktion)
/data/build/php/532/php-5.3.2/main/streams/glob_wrapper.c:251: Fehler:
»GLOB_APPEND« nicht deklariert (erste Benutzung in dieser Funktion)
make: *** [main/streams/glob_wrapper.lo] Error 1

My configure-scrit reads:
#!/bin/sh
#
/data/build/php/532/php-5.3.2/configure \
--prefix=/usr/local/php-5.2.3 \
--enable-bcmath \
--enable-calendar \
--enable-exif \
--enable-ftp \
--enable-gd-native-ttf \
--enable-magic-quotes \
--enable-mbstring \
--enable-safe-mode \
--enable-shmop \
--enable-sigchild \
--enable-sysvsem \
--enable-sysvshm \
--enable-wddx \
--with-bz2 \
--with-libxml-dir=/usr/local \
--with-gettext=/usr/local \
--with-jpeg-dir=/usr/local \
--with-ldap \
--with-mysql \
--with-ndbm \
--with-iconv-dir=/usr/local \
--with-pgsql=/usr/local/pgsql \
--with-png-dir=/usr/local \
--with-freetype-dir=/usr/local \
--with-xpm-dir=/usr/local \
--with-zlib=/usr/local \
--with-gd=/usr/local \
--with-openssl=/usr/local/ssl \
--with-imap=/usr/local/imap-2007e \
--with-imap-ssl=/usr/local/ssl \
--with-pear \
--with-oci8=/opt/oracle/client \
--with-apxs2=/usr/local/apache2/bin/apxs

IMAP compiled as described here:
http://de3.php.net/manual/de/imap.requirements.php

Oracle Client version: 11.2.0.1.0

Thanks for helping!


--
Edit bug report at http://bugs.php.net/bug.php?id=52345&edit=1
--
Try a snapshot (PHP 5.2): http://bugs.php.net/fix.php?id=52345&r=trysnapshot52
Try a snapshot (PHP 5.3): http://bugs.php.net/fix.php?id=52345&r=trysnapshot53
Try a snapshot (trunk): http://bugs.php.net/fix.php?id=52345&r=trysnapshottrunk
Fixed in SVN: http://bugs.php.net/fix.php?id=52345&r=fixed
Fixed in SVN and need be documented: http://bugs.php.net/fix.php?id=52345&r=needdocs
Fixed in release: http://bugs.php.net/fix.php?id=52345&r=alreadyfixed
Need backtrace: http://bugs.php.net/fix.php?id=52345&r=needtrace
Need Reproduce Script: http://bugs.php.net/fix.php?id=52345&r=needscript
Try newer version: http://bugs.php.net/fix.php?id=52345&r=oldversion
Not developer issue: http://bugs.php.net/fix.php?id=52345&r=support
Expected behavior: http://bugs.php.net/fix.php?id=52345&r=notwrong
Not enough info: http://bugs.php.net/fix.php?id=52345&r=notenoughinfo
Submitted twice: http://bugs.php.net/fix.php?id=52345&r=submittedtwice
register_globals: http://bugs.php.net/fix.php?id=52345&r=globals
PHP 4 support discontinued: http://bugs.php.net/fix.php?id=52345&r=php4
Daylight Savings: http://bugs.php.net/fix.php?id=52345&r=dst
IIS Stability: http://bugs.php.net/fix.php?id=52345&r=isapi
Install GNU Sed: http://bugs.php.net/fix.php?id=52345&r=gnused
Floating point limitations: http://bugs.php.net/fix.php?id=52345&r=float
No Zend Extensions: http://bugs.php.net/fix.php?id=52345&r=nozend
MySQL Configuration Error: http://bugs.php.net/fix.php?id=52345&r=mysqlcfg
reply
Tweet

Search Discussions

  • Christian dot schaffer at muenchen dot de at Jul 15, 2010 at 10:36 am
    Edit report at http://bugs.php.net/bug.php?id=52345&edit=1

      ID: 52345
      Comment by: christian dot schaffer at muenchen dot de
      Reported by: christian dot schaffer at muenchen dot de
      Summary: make fails: glob_wrapper.c:40
      Status: Open
      Type: Bug
      Package: Compile Failure
      Operating System: Solaris 10 x86
      PHP Version: 5.3.2

      New Comment:

    Additional comment:
    PHP 5.2.13 make runs successfully with same configuration.


    Previous Comments:
    ------------------------------------------------------------------------
    [2010-07-15 11:01:52] christian dot schaffer at muenchen dot de

    Description:
    ------------
    On Solaris 10 (11/09) x86, opensource packages from www.sunfreeware.com
    Desired PHP-Version 5.3.2

    Make fails with following error:
    /bin/sh /data/build/php/532/php-5.3.2/libtool --silent
    --preserve-dup-deps --mode=compile gcc -Imain/streams/
    -I/data/build/php/532/php-5.3.2/main/streams/ -DPHP_ATOM_INC
    -I/data/build/php/532/php-5.3.2/include
    -I/data/build/php/532/php-5.3.2/main -I/data/build/php/532/php-5.3.2
    -I/data/build/php/532/php-5.3.2/ext/date/lib
    -I/data/build/php/532/php-5.3.2/ext/ereg/regex
    -I/usr/local/include/libxml2 -I/usr/local/ssl/include
    -I/usr/local/include -I/usr/local/include/freetype2
    -I/usr/local/imap-2007e/include
    -I/data/build/php/532/php-5.3.2/ext/mbstring/oniguruma
    -I/data/build/php/532/php-5.3.2/ext/mbstring/libmbfl
    -I/data/build/php/532/php-5.3.2/ext/mbstring/libmbfl/mbfl
    -I/usr/include/mysql -I/opt/oracle/client/rdbms/public
    -I/data/build/php/532/php-5.3.2/ext/sqlite3/libsqlite
    -I/usr/local/pgsql/include -I/data/build/php/532/php-5.3.2/TSRM
    -I/data/build/php/532/php-5.3.2/Zend -D_POSIX_PTHREAD_SEMANTICS
    -I/usr/local/include -g -O2 -c
    /data/build/php/532/php-5.3.2/main/streams/glob_wrapper.c -o
    main/streams/glob_wrapper.lo
    /data/build/php/532/php-5.3.2/main/streams/glob_wrapper.c:40: Fehler:
    Syntaxfehler vor "glob_t"
    /data/build/php/532/php-5.3.2/main/streams/glob_wrapper.c:40: Warnung:
    kein Semikolon am Ende von »struct« oder »union«
    /data/build/php/532/php-5.3.2/main/streams/glob_wrapper.c:47: Fehler:
    Syntaxfehler vor »}«-Zeichen
    /data/build/php/532/php-5.3.2/main/streams/glob_wrapper.c:47: Warnung:
    Datendefinition hat keinen Typ oder Speicherklasse
    /data/build/php/532/php-5.3.2/main/streams/glob_wrapper.c: In function
    `_php_glob_stream_get_path':
    /data/build/php/532/php-5.3.2/main/streams/glob_wrapper.c:51: Fehler:
    »pglob« nicht deklariert (erste Benutzung in dieser Funktion)
    /data/build/php/532/php-5.3.2/main/streams/glob_wrapper.c:51: Fehler:
    (Jeder nicht deklarierte Bezeichner wird nur einmal aufgeführt
    /data/build/php/532/php-5.3.2/main/streams/glob_wrapper.c:51: Fehler:
    für jede Funktion in der er auftritt.)
    /data/build/php/532/php-5.3.2/main/streams/glob_wrapper.c:51: Fehler:
    Syntaxfehler vor »)«-Zeichen
    /data/build/php/532/php-5.3.2/main/streams/glob_wrapper.c: In function
    `_php_glob_stream_get_pattern':
    /data/build/php/532/php-5.3.2/main/streams/glob_wrapper.c:73: Fehler:
    »pglob« nicht deklariert (erste Benutzung in dieser Funktion)
    /data/build/php/532/php-5.3.2/main/streams/glob_wrapper.c:73: Fehler:
    Syntaxfehler vor »)«-Zeichen
    /data/build/php/532/php-5.3.2/main/streams/glob_wrapper.c: In function
    `_php_glob_stream_get_count':
    /data/build/php/532/php-5.3.2/main/streams/glob_wrapper.c:95: Fehler:
    »pglob« nicht deklariert (erste Benutzung in dieser Funktion)
    /data/build/php/532/php-5.3.2/main/streams/glob_wrapper.c:95: Fehler:
    Syntaxfehler vor »)«-Zeichen
    /data/build/php/532/php-5.3.2/main/streams/glob_wrapper.c: At top
    level:
    /data/build/php/532/php-5.3.2/main/streams/glob_wrapper.c:111: Fehler:
    Syntaxfehler vor »*«-Zeichen
    /data/build/php/532/php-5.3.2/main/streams/glob_wrapper.c: In function
    `php_glob_stream_path_split':
    /data/build/php/532/php-5.3.2/main/streams/glob_wrapper.c:124: Fehler:
    »p_file« nicht deklariert (erste Benutzung in dieser Funktion)
    /data/build/php/532/php-5.3.2/main/streams/glob_wrapper.c:126: Fehler:
    »get_path« nicht deklariert (erste Benutzung in dieser Funktion)
    /data/build/php/532/php-5.3.2/main/streams/glob_wrapper.c:127: Fehler:
    »pglob« nicht deklariert (erste Benutzung in dieser Funktion)
    /data/build/php/532/php-5.3.2/main/streams/glob_wrapper.c: In function
    `php_glob_stream_read':
    /data/build/php/532/php-5.3.2/main/streams/glob_wrapper.c:141: Fehler:
    »pglob« nicht deklariert (erste Benutzung in dieser Funktion)
    /data/build/php/532/php-5.3.2/main/streams/glob_wrapper.c:141: Fehler:
    Syntaxfehler vor »)«-Zeichen
    /data/build/php/532/php-5.3.2/main/streams/glob_wrapper.c:148: Fehler:
    »GLOB_APPEND« nicht deklariert (erste Benutzung in dieser Funktion)
    /data/build/php/532/php-5.3.2/main/streams/glob_wrapper.c: In function
    `php_glob_stream_close':
    /data/build/php/532/php-5.3.2/main/streams/glob_wrapper.c:165: Fehler:
    »pglob« nicht deklariert (erste Benutzung in dieser Funktion)
    /data/build/php/532/php-5.3.2/main/streams/glob_wrapper.c:165: Fehler:
    Syntaxfehler vor »)«-Zeichen
    /data/build/php/532/php-5.3.2/main/streams/glob_wrapper.c: In function
    `php_glob_stream_rewind':
    /data/build/php/532/php-5.3.2/main/streams/glob_wrapper.c:184: Fehler:
    »pglob« nicht deklariert (erste Benutzung in dieser Funktion)
    /data/build/php/532/php-5.3.2/main/streams/glob_wrapper.c:184: Fehler:
    Syntaxfehler vor »)«-Zeichen
    /data/build/php/532/php-5.3.2/main/streams/glob_wrapper.c: In function
    `php_glob_stream_opener':
    /data/build/php/532/php-5.3.2/main/streams/glob_wrapper.c:211: Fehler:
    »pglob« nicht deklariert (erste Benutzung in dieser Funktion)
    /data/build/php/532/php-5.3.2/main/streams/glob_wrapper.c:251: Fehler:
    »GLOB_APPEND« nicht deklariert (erste Benutzung in dieser Funktion)
    make: *** [main/streams/glob_wrapper.lo] Error 1

    My configure-scrit reads:
    #!/bin/sh
    #
    /data/build/php/532/php-5.3.2/configure \
    --prefix=/usr/local/php-5.2.3 \
    --enable-bcmath \
    --enable-calendar \
    --enable-exif \
    --enable-ftp \
    --enable-gd-native-ttf \
    --enable-magic-quotes \
    --enable-mbstring \
    --enable-safe-mode \
    --enable-shmop \
    --enable-sigchild \
    --enable-sysvsem \
    --enable-sysvshm \
    --enable-wddx \
    --with-bz2 \
    --with-libxml-dir=/usr/local \
    --with-gettext=/usr/local \
    --with-jpeg-dir=/usr/local \
    --with-ldap \
    --with-mysql \
    --with-ndbm \
    --with-iconv-dir=/usr/local \
    --with-pgsql=/usr/local/pgsql \
    --with-png-dir=/usr/local \
    --with-freetype-dir=/usr/local \
    --with-xpm-dir=/usr/local \
    --with-zlib=/usr/local \
    --with-gd=/usr/local \
    --with-openssl=/usr/local/ssl \
    --with-imap=/usr/local/imap-2007e \
    --with-imap-ssl=/usr/local/ssl \
    --with-pear \
    --with-oci8=/opt/oracle/client \
    --with-apxs2=/usr/local/apache2/bin/apxs

    IMAP compiled as described here:
    http://de3.php.net/manual/de/imap.requirements.php

    Oracle Client version: 11.2.0.1.0

    Thanks for helping!



    ------------------------------------------------------------------------



    --
    Edit this bug report at http://bugs.php.net/bug.php?id=52345&edit=1
    reply | permalink
  • Aharvey at Jul 16, 2010 at 3:58 am
    Edit report at http://bugs.php.net/bug.php?id=52345&edit=1

      ID: 52345
      Updated by: aharvey@php.net
      Reported by: christian dot schaffer at muenchen dot de
      Summary: make fails: glob_wrapper.c:40
    -Status: Open
    +Status: Duplicate
      Type: Bug
      Package: Compile Failure
      Operating System: Solaris 10 x86
      PHP Version: 5.3.2

      New Comment:

    Duplicate of bug #49301.

    Bug #51974 (which was also a dupe of #49301) has the compilation errors
    in English, for other people like me who aren't particularly fluent in
    German. :)


    Previous Comments:
    ------------------------------------------------------------------------
    [2010-07-15 12:36:34] christian dot schaffer at muenchen dot de

    Additional comment:
    PHP 5.2.13 make runs successfully with same configuration.

    ------------------------------------------------------------------------
    [2010-07-15 11:01:52] christian dot schaffer at muenchen dot de

    Description:
    ------------
    On Solaris 10 (11/09) x86, opensource packages from www.sunfreeware.com
    Desired PHP-Version 5.3.2

    Make fails with following error:
    /bin/sh /data/build/php/532/php-5.3.2/libtool --silent
    --preserve-dup-deps --mode=compile gcc -Imain/streams/
    -I/data/build/php/532/php-5.3.2/main/streams/ -DPHP_ATOM_INC
    -I/data/build/php/532/php-5.3.2/include
    -I/data/build/php/532/php-5.3.2/main -I/data/build/php/532/php-5.3.2
    -I/data/build/php/532/php-5.3.2/ext/date/lib
    -I/data/build/php/532/php-5.3.2/ext/ereg/regex
    -I/usr/local/include/libxml2 -I/usr/local/ssl/include
    -I/usr/local/include -I/usr/local/include/freetype2
    -I/usr/local/imap-2007e/include
    -I/data/build/php/532/php-5.3.2/ext/mbstring/oniguruma
    -I/data/build/php/532/php-5.3.2/ext/mbstring/libmbfl
    -I/data/build/php/532/php-5.3.2/ext/mbstring/libmbfl/mbfl
    -I/usr/include/mysql -I/opt/oracle/client/rdbms/public
    -I/data/build/php/532/php-5.3.2/ext/sqlite3/libsqlite
    -I/usr/local/pgsql/include -I/data/build/php/532/php-5.3.2/TSRM
    -I/data/build/php/532/php-5.3.2/Zend -D_POSIX_PTHREAD_SEMANTICS
    -I/usr/local/include -g -O2 -c
    /data/build/php/532/php-5.3.2/main/streams/glob_wrapper.c -o
    main/streams/glob_wrapper.lo
    /data/build/php/532/php-5.3.2/main/streams/glob_wrapper.c:40: Fehler:
    Syntaxfehler vor "glob_t"
    /data/build/php/532/php-5.3.2/main/streams/glob_wrapper.c:40: Warnung:
    kein Semikolon am Ende von »struct« oder »union«
    /data/build/php/532/php-5.3.2/main/streams/glob_wrapper.c:47: Fehler:
    Syntaxfehler vor »}«-Zeichen
    /data/build/php/532/php-5.3.2/main/streams/glob_wrapper.c:47: Warnung:
    Datendefinition hat keinen Typ oder Speicherklasse
    /data/build/php/532/php-5.3.2/main/streams/glob_wrapper.c: In function
    `_php_glob_stream_get_path':
    /data/build/php/532/php-5.3.2/main/streams/glob_wrapper.c:51: Fehler:
    »pglob« nicht deklariert (erste Benutzung in dieser Funktion)
    /data/build/php/532/php-5.3.2/main/streams/glob_wrapper.c:51: Fehler:
    (Jeder nicht deklarierte Bezeichner wird nur einmal aufgeführt
    /data/build/php/532/php-5.3.2/main/streams/glob_wrapper.c:51: Fehler:
    für jede Funktion in der er auftritt.)
    /data/build/php/532/php-5.3.2/main/streams/glob_wrapper.c:51: Fehler:
    Syntaxfehler vor »)«-Zeichen
    /data/build/php/532/php-5.3.2/main/streams/glob_wrapper.c: In function
    `_php_glob_stream_get_pattern':
    /data/build/php/532/php-5.3.2/main/streams/glob_wrapper.c:73: Fehler:
    »pglob« nicht deklariert (erste Benutzung in dieser Funktion)
    /data/build/php/532/php-5.3.2/main/streams/glob_wrapper.c:73: Fehler:
    Syntaxfehler vor »)«-Zeichen
    /data/build/php/532/php-5.3.2/main/streams/glob_wrapper.c: In function
    `_php_glob_stream_get_count':
    /data/build/php/532/php-5.3.2/main/streams/glob_wrapper.c:95: Fehler:
    »pglob« nicht deklariert (erste Benutzung in dieser Funktion)
    /data/build/php/532/php-5.3.2/main/streams/glob_wrapper.c:95: Fehler:
    Syntaxfehler vor »)«-Zeichen
    /data/build/php/532/php-5.3.2/main/streams/glob_wrapper.c: At top
    level:
    /data/build/php/532/php-5.3.2/main/streams/glob_wrapper.c:111: Fehler:
    Syntaxfehler vor »*«-Zeichen
    /data/build/php/532/php-5.3.2/main/streams/glob_wrapper.c: In function
    `php_glob_stream_path_split':
    /data/build/php/532/php-5.3.2/main/streams/glob_wrapper.c:124: Fehler:
    »p_file« nicht deklariert (erste Benutzung in dieser Funktion)
    /data/build/php/532/php-5.3.2/main/streams/glob_wrapper.c:126: Fehler:
    »get_path« nicht deklariert (erste Benutzung in dieser Funktion)
    /data/build/php/532/php-5.3.2/main/streams/glob_wrapper.c:127: Fehler:
    »pglob« nicht deklariert (erste Benutzung in dieser Funktion)
    /data/build/php/532/php-5.3.2/main/streams/glob_wrapper.c: In function
    `php_glob_stream_read':
    /data/build/php/532/php-5.3.2/main/streams/glob_wrapper.c:141: Fehler:
    »pglob« nicht deklariert (erste Benutzung in dieser Funktion)
    /data/build/php/532/php-5.3.2/main/streams/glob_wrapper.c:141: Fehler:
    Syntaxfehler vor »)«-Zeichen
    /data/build/php/532/php-5.3.2/main/streams/glob_wrapper.c:148: Fehler:
    »GLOB_APPEND« nicht deklariert (erste Benutzung in dieser Funktion)
    /data/build/php/532/php-5.3.2/main/streams/glob_wrapper.c: In function
    `php_glob_stream_close':
    /data/build/php/532/php-5.3.2/main/streams/glob_wrapper.c:165: Fehler:
    »pglob« nicht deklariert (erste Benutzung in dieser Funktion)
    /data/build/php/532/php-5.3.2/main/streams/glob_wrapper.c:165: Fehler:
    Syntaxfehler vor »)«-Zeichen
    /data/build/php/532/php-5.3.2/main/streams/glob_wrapper.c: In function
    `php_glob_stream_rewind':
    /data/build/php/532/php-5.3.2/main/streams/glob_wrapper.c:184: Fehler:
    »pglob« nicht deklariert (erste Benutzung in dieser Funktion)
    /data/build/php/532/php-5.3.2/main/streams/glob_wrapper.c:184: Fehler:
    Syntaxfehler vor »)«-Zeichen
    /data/build/php/532/php-5.3.2/main/streams/glob_wrapper.c: In function
    `php_glob_stream_opener':
    /data/build/php/532/php-5.3.2/main/streams/glob_wrapper.c:211: Fehler:
    »pglob« nicht deklariert (erste Benutzung in dieser Funktion)
    /data/build/php/532/php-5.3.2/main/streams/glob_wrapper.c:251: Fehler:
    »GLOB_APPEND« nicht deklariert (erste Benutzung in dieser Funktion)
    make: *** [main/streams/glob_wrapper.lo] Error 1

    My configure-scrit reads:
    #!/bin/sh
    #
    /data/build/php/532/php-5.3.2/configure \
    --prefix=/usr/local/php-5.2.3 \
    --enable-bcmath \
    --enable-calendar \
    --enable-exif \
    --enable-ftp \
    --enable-gd-native-ttf \
    --enable-magic-quotes \
    --enable-mbstring \
    --enable-safe-mode \
    --enable-shmop \
    --enable-sigchild \
    --enable-sysvsem \
    --enable-sysvshm \
    --enable-wddx \
    --with-bz2 \
    --with-libxml-dir=/usr/local \
    --with-gettext=/usr/local \
    --with-jpeg-dir=/usr/local \
    --with-ldap \
    --with-mysql \
    --with-ndbm \
    --with-iconv-dir=/usr/local \
    --with-pgsql=/usr/local/pgsql \
    --with-png-dir=/usr/local \
    --with-freetype-dir=/usr/local \
    --with-xpm-dir=/usr/local \
    --with-zlib=/usr/local \
    --with-gd=/usr/local \
    --with-openssl=/usr/local/ssl \
    --with-imap=/usr/local/imap-2007e \
    --with-imap-ssl=/usr/local/ssl \
    --with-pear \
    --with-oci8=/opt/oracle/client \
    --with-apxs2=/usr/local/apache2/bin/apxs

    IMAP compiled as described here:
    http://de3.php.net/manual/de/imap.requirements.php

    Oracle Client version: 11.2.0.1.0

    Thanks for helping!



    ------------------------------------------------------------------------



    --
    Edit this bug report at http://bugs.php.net/bug.php?id=52345&edit=1
    reply | permalink
  • Xrumer at chaneljpoutlet dot com at May 10, 2012 at 10:18 am
    Edit report at https://bugs.php.net/bug.php?id=52345&edit=1

      ID: 52345
      User updated by: xrumer@chaneljpoutlet.com
      Reported by: xrumer@chaneljpoutlet.com
      Summary: make fails: glob_wrapper.c:40
      Status: Open
      Type: Bug
      Package: *General Issues
      Operating System: Solaris 10 x86
      PHP Version: 5.3.2
      Block user comment: N
      Private report: N

      New Comment:

    あなたは信頼性と低シャネルのハンドバッグを探している場合は、するには、のために外に見えることができますか?すべての女性にこのクエリを要求し、彼女は答えを用いて調製することができます。彼女は途方も減少し販売価格背面倍の量で彼らのシングルを得たので、彼女は、知っています。悪い女の子でも、彼女が得たより低いシャネルの財布が信頼できるものではありませんことを認識していません。女性が人生のすべての他の要因で非常に賢明であるにもかかわらず、彼らはより低い漏斗シャネルコンセントを見て、同じで販売価格に見えるように気にしないと、彼らは単に溶かす。<a href=http://www.chaneljpoutlet.com/>シャネル</a>


      å½¼ã‚‰ã¯ãã‚ŒãŒå‰²å¼•ä¾¡æ ¼ã®ã“の種では、これらの優れたバッグを入手することは不可能であることを実現する、しかしそれらは非常に低い値を付けられるという事実だけのため偽物を介してよりも圧倒されています。あなたは下のシャネルのバッグを買って約本当に熱心であれば、あなたの理想的な選択は、それらの割引を提供していて有名なお店を探すためであろう。あなたは、単に最新モデルを購入することができるように大型店を離れ明白にその時代遅れの株式やバッグの株式を望むのインスタンスがあります。インスタンスのこの種で、彼らはシャネルの財布、シャネルの10%と有意に割引を提供しています。あなたは、ある瞬間の利益を考慮し、低シャネルのハンドバッグを購入する必要があります。あなたが低コストで、それらのブランドの財布の役に立つことができれば他の機会にはお祝いの季節やクリスマスのように、あまりにもあります。<a href=http://www.chaneljpoutlet.com/>シャネル</a>

      ã‚¦ã‚§ãƒ–ストアの異なる多くはそこにあることができる安価な模造品にだまされません。それらの大半は、投資、安価でインポートされた偽のバッグ。彼らは本物の似ているが、あなたがそれを与える欠陥の量を発見するように見えるの近くにとも考えるかもしれません。生産重複ブランド財布を専門に怪しげ​​な機関があります。あなたは、単にネットの周りに気づいていることが減少し価格のバッグは、これらの機関から発信さになっています。あなたはそれらの色が正常に動作していること、またはそれらのステッチが離れて落ちていることを発見するでしょう正確に同じものを利用しているの倍の量の内部。<a href=http://www.chaneljpoutlet.com/>シャネル バッグ</a>


      èª°ã‚‚彼らがオンラインで購入後、そのカードを確保するために求めるために気になるはありません。彼らはこれらの安価なシャネル2.55マーチャンダイジングすることができ、Webページ上で賢明な文章を通じて、だまされています。ウェブショップ上で、特定のそれにもかかわらず、現在でもシャネルのバッグに大規模な低価格を提供している場合に驚いてはいけません。あなたが経験したので、前に1週間と同じか正確に訪問した場合、Webサイトでは、それがされて、最終的なメガ利益の日を経験したと主張した。<a href=http://www.chaneljpoutlet.com/>シャネル 財布</a>


    Previous Comments:
    ------------------------------------------------------------------------
    [2010-07-16 05:58:47] aharvey@php.net